{"text_format":"1","workbook":"xlsx","n_sheets":2,"sheets":["Sondeo Precios","IPC"],"not_rendered":{"charts":0,"images":3,"macros":1,"external_links":0,"defined_names":2,"comments":1,"pivot_tables":0},"unopened":[],"bounds":{"document_bytes":16777216,"sheet_cells":100000,"rows_first":2000,"rows_last":500,"rows_between":2000,"halvings":0,"cell_chars":16384,"cell_head_chars":4096},"cells_cut":0,"cells_raw":0,"read":"whole","date_system":"1900"}

{"sheet":"Sondeo Precios","index":0,"n_rows":122,"n_cols":131,"rows_kept":122,"cut":false,"hidden":false,"merged":[[0,5,0,6],[0,1,0,4],[1,1,1,4],[4,1,4,6],[2,1,2,4],[5,2,5,4],[14,5,14,6],[15,3,15,4],[15,5,15,6],[16,3,16,4],[16,5,16,6],[6,1,6,4],[14,3,14,4],[12,1,12,6],[7,0,11,3],[7,4,7,6],[8,4,8,6],[9,4,9,6],[10,4,10,6],[11,4,11,6],[35,1,36,3],[35,5,35,6],[36,5,36,6],[17,3,17,4],[17,5,17,6],[18,3,18,4],[18,5,18,6],[19,3,19,4],[19,5,19,6],[20,3,20,4],[20,5,20,6],[26,3,26,4],[27,0,27,3],[28,0,28,3],[29,0,29,3],[33,0,34,6],[32,0,32,6],[30,0,30,3],[31,0,31,2],[31,4,31,5],[21,3,21,4],[22,3,22,4],[23,3,23,4],[24,3,24,4],[25,3,25,4],[21,5,21,6],[22,5,22,6],[23,5,23,6],[26,5,26,6],[24,5,24,6],[25,5,25,6]]}
[null,"DIRECCIÓN EJECUTIVA",null,null,null,"R13-v01-DE-P20-v01"]
[null,"ÁREA DE PLANIFICACIÓN INSTITUCIONAL"]
[null,"SONDEO DE PRECIOS DE MERCADO - POA 2026"]
[]
["Dependencia:",null,null,null,null,null,null,null,null,null,null,null,null,null,null,null,null,null,null,null,null,null,null,null,null,null,null,null,null,null,null,null,null,null,null,null,null,null,null,null,null,null,null,null,null,null,null,null,null,null,null,null,null,"SI"]
["Número de objetivo:",null,null,null,null,"Código SICOP:",null,null,null,null,null,null,null,null,null,null,null,null,null,null,null,null,null,null,null,null,null,null,null,null,null,null,null,null,null,null,null,null,null,null,null,null,null,null,null,null,null,null,null,null,null,null,null,"NO"]
["Nombre del requerimiento (bien, servicio u obra):",null,null,null,null,"Unidad de medida:"]
["Precios incluidos en Banco de precios del SICOP:"]
[]
[]
[]
[]
["Observaciones de la búsqueda en el Banco de precios del SICOP:"]
[]
["Oferentes potenciales y existentes","Precio consultado en Internet","Precio ofertado -según unidad de medida- en dólares","Comparativo de precios (colones) ",null,"Precio ofertado -según unidad de medida- en colones"]
[null,null,null,{"$f":"IF(C16>0,C16*$D$32,\"\")","v":""}]
[null,null,null,""]
[null,null,null,""]
[null,null,null,""]
[null,null,null,""]
[null,null,null,""]
[]
[]
[]
[null,null,null,null,null,null,null,null,null,null,null,null,null,null,null,null,null,null,null,null,null,null,null,null,null,null,null,null,null,null,null,null,null,null,null,null,null,null,null,null,null,null,null,null,null,null,null,null,null,null,null,null,null,null,null,null,null,null,null,null,null,null,null,null,null,null,null,null,null,null,null,null,null,null,null,null,null,null,null,null,null,null,null,null,null,null,null,null,null,null,null,null,null,null,null,null,null,null,null,null,null,null,null,null,null,null,null,null,null,null,null,null,null,null,null,null,null,null,null,null,null,null,null,null,null,null,null,null,null,null,"ARCHIVO CENTRAL"]
[null,null,null,null,null,null,null,null,null,null,null,null,null,null,null,null,null,null,null,null,null,null,null,null,null,null,null,null,null,null,null,null,null,null,null,null,null,null,null,null,null,null,null,null,null,null,null,null,null,null,null,null,null,null,null,null,null,null,null,null,null,null,null,null,null,null,null,null,null,null,null,null,null,null,null,null,null,null,null,null,null,null,null,null,null,null,null,null,null,null,null,null,null,null,null,null,null,null,null,null,null,null,null,null,null,null,null,null,null,null,null,null,null,null,null,null,null,null,null,null,null,null,null,null,null,null,null,null,null,null,"ARCHIVO DEL REGISTRO CIVIL"]
[null,null,null,"",null,null,null,null,null,null,null,null,null,null,null,null,null,null,null,null,null,null,null,null,null,null,null,null,null,null,null,null,null,null,null,null,null,null,null,null,null,null,null,null,null,null,null,null,null,null,null,null,null,null,null,null,null,null,null,null,null,null,null,null,null,null,null,null,null,null,null,null,null,null,null,null,null,null,null,null,null,null,null,null,null,null,null,null,null,null,null,null,null,null,null,null,null,null,null,null,null,null,null,null,null,null,null,null,null,null,null,null,null,null,null,null,null,null,null,null,null,null,null,null,null,null,null,null,null,null,"ARCHIVO DEL TSE"]
["Precios históricos del TSE (Número de licitación y oferta de las contrataciones)",null,null,null,"Precio oferta unitario","Mes/Año","Valor presente",null,null,null,null,null,null,null,null,null,null,null,null,null,null,null,null,null,null,null,null,null,null,null,null,null,null,null,null,null,null,null,null,null,null,null,null,null,null,null,null,null,null,null,null,null,null,null,null,null,null,null,null,null,null,null,null,null,null,null,null,null,null,null,null,null,null,null,null,null,null,null,null,null,null,null,null,null,null,null,null,null,null,null,null,null,null,null,null,null,null,null,null,null,null,null,null,null,null,null,null,null,null,null,null,null,null,null,null,null,null,null,null,null,null,null,null,null,null,null,null,null,null,null,"AUDITORÍA INTERNA"]
[null,null,null,null,null,null,{"$f":"IF(F29=\"\",\"\",LOOKUP(F29,IPC!$A$2:$A$48,IPC!$B$2:$B$48)/(IPC!$B$34)*'Sondeo Precios'!E29)","v":""},null,null,null,null,null,null,null,null,null,null,null,null,null,null,null,null,null,null,null,null,null,null,null,null,null,null,null,null,null,null,null,null,null,null,null,null,null,null,null,null,null,null,null,null,null,null,null,null,null,null,null,null,null,null,null,null,null,null,null,null,null,null,null,null,null,null,null,null,null,null,null,null,null,null,null,null,null,null,null,null,null,null,null,null,null,null,null,null,null,null,null,null,null,null,null,null,null,null,null,null,null,null,null,null,null,null,null,null,null,null,null,null,null,null,null,null,null,null,null,null,null,null,null,"CENTRO DE DOCUMENTACIÓN IFED"]
[null,null,null,null,null,null,{"$f":"IF(F30=\"\",\"\",LOOKUP(F30,IPC!$A$2:$A$48,IPC!$B$2:$B$48)/(IPC!$B$34)*'Sondeo Precios'!E30)","v":""}]
[null,null,null,null,null,null,{"$f":"IF(F31=\"\",\"\",LOOKUP(F31,IPC!$A$2:$A$48,IPC!$B$2:$B$48)/(IPC!$B$34)*'Sondeo Precios'!E31)","v":""},null,null,null,null,null,null,null,null,null,null,null,null,null,null,null,null,null,null,null,null,null,null,null,null,null,null,null,null,null,null,null,null,null,null,null,null,null,null,null,null,null,null,null,null,null,null,null,null,null,null,null,null,null,null,null,null,null,null,null,null,null,null,null,null,null,null,null,null,null,null,null,null,null,null,null,null,null,null,null,null,null,null,null,null,null,null,null,null,null,null,null,null,null,null,null,null,null,null,null,null,null,null,null,null,null,null,null,null,null,null,null,null,null,null,null,null,null,null,null,null,null,null,null,"COMISIÓN INSTITUCIONAL DE ÉTICA Y VALORES"]
["TIPO DE CAMBIO $",null,null,550,"Precio promedio sugerido para el requerimiento (colones)",null,{"$f":"AVERAGE(PROMEDIOREQ)","v":{"$error":"#DIV/0!"}},null,null,null,null,null,null,null,null,null,null,null,null,null,null,null,null,null,null,null,null,null,null,null,null,null,null,null,null,null,null,null,null,null,null,null,null,null,null,null,null,null,null,null,null,null,null,null,null,null,null,null,null,null,null,null,null,null,null,null,null,null,null,null,null,null,null,null,null,null,null,null,null,null,null,null,null,null,null,null,null,null,null,null,null,null,null,null,null,null,null,null,null,null,null,null,null,null,null,null,null,null,null,null,null,null,null,null,null,null,null,null,null,null,null,null,null,null,null,null,null,null,null,null,"COMISIÓN INSTITUCIONAL DE GESTIÓN AMBIENTAL"]
["Observaciones generales",null,null,null,null,null,null,null,null,null,null,null,null,null,null,null,null,null,null,null,null,null,null,null,null,null,null,null,null,null,null,null,null,null,null,null,null,null,null,null,null,null,null,null,null,null,null,null,null,null,null,null,null,null,null,null,null,null,null,null,null,null,null,null,null,null,null,null,null,null,null,null,null,null,null,null,null,null,null,null,null,null,null,null,null,null,null,null,null,null,null,null,null,null,null,null,null,null,null,null,null,null,null,null,null,null,null,null,null,null,null,null,null,null,null,null,null,null,null,null,null,null,null,null,null,null,null,null,null,null,"COMISIÓN INSTITUCIONAL EN MATERIA DE DISCAPACIDAD"]
["dsadsadsa",null,null,null,null,null,null,null,null,null,null,null,null,null,null,null,null,null,null,null,null,null,null,null,null,null,null,null,null,null,null,null,null,null,null,null,null,null,null,null,null,null,null,null,null,null,null,null,null,null,null,null,null,null,null,null,null,null,null,null,null,null,null,null,null,null,null,null,null,null,null,null,null,null,null,null,null,null,null,null,null,null,null,null,null,null,null,null,null,null,null,null,null,null,null,null,null,null,null,null,null,null,null,null,null,null,null,null,null,null,null,null,null,null,null,null,null,null,null,null,null,null,null,null,null,null,null,null,null,null,"CONTRALORÍA DE SERVICIOS"]
[null,null,null,null,null,null,null,null,null,null,null,null,null,null,null,null,null,null,null,null,null,null,null,null,null,null,null,null,null,null,null,null,null,null,null,null,null,null,null,null,null,null,null,null,null,null,null,null,null,null,null,null,null,null,null,null,null,null,null,null,null,null,null,null,null,null,null,null,null,null,null,null,null,null,null,null,null,null,null,null,null,null,null,null,null,null,null,null,null,null,null,null,null,null,null,null,null,null,null,null,null,null,null,null,null,null,null,null,null,null,null,null,null,null,null,null,null,null,null,null,null,null,null,null,null,null,null,null,null,null,"CONTRALORÍA ELECTORAL"]
[null,null,null,null,"Elaborado por:",null,null,null,null,null,null,null,null,null,null,null,null,null,null,null,null,null,null,null,null,null,null,null,null,null,null,null,null,null,null,null,null,null,null,null,null,null,null,null,null,null,null,null,null,null,null,null,null,null,null,null,null,null,null,null,null,null,null,null,null,null,null,null,null,null,null,null,null,null,null,null,null,null,null,null,null,null,null,null,null,null,null,null,null,null,null,null,null,null,null,null,null,null,null,null,null,null,null,null,null,null,null,null,null,null,null,null,null,null,null,null,null,null,null,null,null,null,null,null,null,null,null,null,null,null,"DEPARTAMENTO CIVIL"]
["Nuevo sondeo de precios",null,null,null,"Responsable:",null,null,null,null,null,null,null,null,null,null,null,null,null,null,null,null,null,null,null,null,null,null,null,null,null,null,null,null,null,null,null,null,null,null,null,null,null,null,null,null,null,null,null,null,null,null,null,null,null,null,null,null,null,null,null,null,null,null,null,null,null,null,null,null,null,null,null,null,null,null,null,null,null,null,null,null,null,null,null,null,null,null,null,null,null,null,null,null,null,null,null,null,null,null,null,null,null,null,null,null,null,null,null,null,null,null,null,null,null,null,null,null,null,null,null,null,null,null,null,null,null,null,null,null,null,"DEPARTAMENTO DE COMERCIALIZACIÓN DE SERVICIOS"]
[null,null,null,null,null,null,null,null,null,null,null,null,null,null,null,null,null,null,null,null,null,null,null,null,null,null,null,null,null,null,null,null,null,null,null,null,null,null,null,null,null,null,null,null,null,null,null,null,null,null,null,null,null,null,null,null,null,null,null,null,null,null,null,null,null,null,null,null,null,null,null,null,null,null,null,null,null,null,null,null,null,null,null,null,null,null,null,null,null,null,null,null,null,null,null,null,null,null,null,null,null,null,null,null,null,null,null,null,null,null,null,null,null,null,null,null,null,null,null,null,null,null,null,null,null,null,null,null,null,null,"DEPARTAMENTO DE COMUNICACIÓN Y RELACIONES PÚBLICAS"]
[null,null,null,null,null,null,null,null,null,null,null,null,null,null,null,null,null,null,null,null,null,null,null,null,null,null,null,null,null,null,null,null,null,null,null,null,null,null,null,null,null,null,null,null,null,null,null,null,null,null,null,null,null,null,null,null,null,null,null,null,null,null,null,null,null,null,null,null,null,null,null,null,null,null,null,null,null,null,null,null,null,null,null,null,null,null,null,null,null,null,null,null,null,null,null,null,null,null,null,null,null,null,null,null,null,null,null,null,null,null,null,null,null,null,null,null,null,null,null,null,null,null,null,null,null,null,null,null,null,null,"DEPARTAMENTO DE CONTADURÍA"]
[null,null,null,null,null,null,null,null,null,null,null,null,null,null,null,null,null,null,null,null,null,null,null,null,null,null,null,null,null,null,null,null,null,null,null,null,null,null,null,null,null,null,null,null,null,null,null,null,null,null,null,null,null,null,null,null,null,null,null,null,null,null,null,null,null,null,null,null,null,null,null,null,null,null,null,null,null,null,null,null,null,null,null,null,null,null,null,null,null,null,null,null,null,null,null,null,null,null,null,null,null,null,null,null,null,null,null,null,null,null,null,null,null,null,null,null,null,null,null,null,null,null,null,null,null,null,null,null,null,null,"DEPARTAMENTO DE COORDINACIÓN DE SERVICIOS REGIONALES "]
{"$rows_left_out":83}
{"sheet":"IPC","index":1,"n_rows":36,"n_cols":2,"rows_kept":36,"cut":false,"hidden":true,"merged":[]}
[null,"Nivel"]
["2022-01-01",103.68120989000001]
["2022-02-01",104.81470219000001]
["2022-03-01",105.73941222000001]
["2022-04-01",107.40707737]
["2022-05-01",108.95706260999999]
["2022-06-01",110.89414488]
["2022-07-01",112.09870001]
["2022-08-01",113.06276989]
["2022-09-01",111.9847259]
["2022-10-01",111.13151259]
["2022-11-01",111.28875462000001]
["2022-12-01",111.43592172]
["2023-01-01",111.61473726]
["2023-02-01",110.66316430000001]
["2023-03-01",110.41034163]
["2023-04-01",110.03083679]
["2023-05-01",109.91499051]
["2023-06-01",109.74253053]
["2023-07-01",109.53713196]
["2023-08-01",109.35645599999999]
["2023-09-01",109.48174312]
["2023-10-01",109.71020555]
["2023-11-01",109.45814135000001]
["2023-12-01",109.46875206]
["2024-01-01",109.52906634999999]
["2024-02-01",109.4111146]
["2024-03-01",109.10052736]
["2024-04-01",109.45778192]
["2024-05-01",109.54703268999999]
["2024-06-01",109.70548476]
["2024-07-01",109.57204643]
["2024-08-01",109.69819957]
["2024-09-01",109.33301018]
["2024-10-01",108.85]
["2024-11-01",109.36]